{"text_format":"2","workbook":"xlsx","n_sheets":2,"sheets":["Sheet1","任务类型"],"not_rendered":{"charts":0,"images":0,"macros":0,"external_links":0,"defined_names":0,"comments":2,"pivot_tables":0},"unopened":[],"bounds":{"document_bytes":16777216,"sheet_cells":100000,"run_cost":"one","rows_first":2000,"rows_last":500,"rows_between":2000,"halvings":0,"cell_chars":16384,"cell_head_chars":4096},"cells_cut":0,"cells_raw":0,"read":"whole","date_system":"1900"}

{"sheet":"Sheet1","index":0,"n_rows":173,"n_cols":12,"rows_kept":173,"cut":false,"hidden":false,"merged":[]}
["ID","任务组ID","任务名字Land","任务描述","是否累计","任务类型","任务参数","下一个任务ID","奖励列表","是否禁用","难度排序","跳转界面ID"]
[1001001,1,"Task_UI_104",{"$f":"INDEX(任务类型!C:C,MATCH(F2,任务类型!A:A,0))","v":"登录{0}次游戏"},0,1,"[1]",0,"[[1,5],[2,10]]"]
[1001002,1,"Task_UI_104",{"$f":"INDEX(任务类型!C:C,MATCH(F3,任务类型!A:A,0))","v":"探险通关{0}次"},0,501,"[1]",0,"[[1,5],[2,10]]",null,null,6001]
[2001001,2,"Task_UI_105",{"$f":"INDEX(任务类型!C:C,MATCH(F4,任务类型!A:A,0))","v":"锻造{0}次装备"},0,302,"[5]",0,"[[1,5],[2,10]]",null,null,2001]
[2001002,2,"Task_UI_105",{"$f":"INDEX(任务类型!C:C,MATCH(F5,任务类型!A:A,0))","v":"强化成功{0}次装备"},0,304,"[5]",0,"[[1,5],[2,10]]",null,null,2002]
[21001001,101,"Task_UI_103",{"$f":"INDEX(任务类型!C:C,MATCH(F6,任务类型!A:A,0))","v":"探险通关{0}"},1,502,"[1,1011]",0,"[[10001,70],[1,1000],[100202,1]]",null,1,6001]
[21001002,101,"Task_UI_103",{"$f":"INDEX(任务类型!C:C,MATCH(F7,任务类型!A:A,0))","v":"领主等级达到{0}级"},1,101,"[3]",0,"[[10001,70],[1,1000],[100202,1]]",null,2]
[21001003,101,"Task_UI_103","穿戴{0}件装备",1,306,"[1]",0,"[[10001,70],[1,1000],[100202,1]]",null,3,8001]
[21002001,102,"Task_UI_103",{"$f":"INDEX(任务类型!C:C,MATCH(F9,任务类型!A:A,0))","v":"探险通关{0}"},1,502,"[1,1015]",0,"[[10001,100],[1,1500],[100101,2],[313001,1]]",null,1,6002]
[21002002,102,"Task_UI_103","使{0}名英雄穿戴{1}件装备",1,307,"[1,3]",0,"[[10001,100],[1,1500],[100202,2],[313002,1]]",null,2,8001]
[21002004,102,"Task_UI_103","强化成功{0}次装备",1,304,"[1]",0,"[[10001,100],[1,1500],[100202,2],[313003,1]]",null,3,2002]
[21002005,102,"Task_UI_103",{"$f":"INDEX(任务类型!C:C,MATCH(F12,任务类型!A:A,0))","v":"领主等级达到{0}级"},1,101,"[7]",0,"[[10001,100],[1,1500],[100101,2],[313004,1]]",null,4]
[21003001,103,"Task_UI_103","领主等级达到{0}级",1,101,"[11]",0,"[[10001,150],[1,2000],[100202,2]]",null,1]
[21003002,103,"Task_UI_103","探险通关{0}",1,502,"[1,1018]",0,"[[10001,150],[1,2000],[100101,2]]",null,2,6002]
[21003003,103,"Task_UI_103","获得{0}个英雄",1,201,"[3]",0,"[[10001,150],[1,2000],[100202,2]]",null,3]
[21003004,103,"Task_UI_103","使{0}名英雄穿戴{1}件装备",1,307,"[1,4]",0,"[[10001,150],[1,2000],[100202,2],[313002,1]]",null,2,8001]
[21003005,103,"Task_UI_103","锻造{0}次装备",1,302,"[1]",0,"[[10001,150],[1,2000],[100202,2]]",null,5,2001]
[21003006,103,"Task_UI_103","{0}个英雄星级达到{1}星",1,202,"[1,1]",0,"[[10001,150],[1,2000],[100102,2]]",null,6,1]
[21004001,104,"Task_UI_103","{1}达到{0}级",1,602,"[2,1]",0,"[[10002,50],[1,2500],[101,5000]]",null,1,5001]
[21004002,104,"Task_UI_103","建造{0}{1}",1,601,"[1,10100]",0,"[[10002,50],[1,2500],[102,5000]]",null,2,5002]
[21004003,104,"Task_UI_103","建造{0}{1}",1,601,"[1,10200]",0,"[[10002,70],[1,3000],[101,5000]]",null,3,5003]
[21004004,104,"Task_UI_103","建造{0}{1}",1,601,"[1,10201]",0,"[[10002,70],[1,3000],[102,5000]]",null,4,5004]
[21004005,104,"Task_UI_103","部队上阵{0}名英雄",1,205,"[3]",0,"[[10002,50],[1,2500],[101,5000]]",null,5,3001]
[21004006,104,"Task_UI_103","{0}支部队兵力达到{1}",1,403,"[1,8000]",0,"[[10002,50],[1,2500],[102,5000]]",null,6,3001]
[21004007,104,"Task_UI_103","加入/创建{0}个联盟",1,4,"[1]",0,"[[10002,50],[1,2500],[103,5000]]",null,7,2]
[21005001,105,"Task_UI_103","攻占{0}个{1}级以上的资源田",1,804,"[1,1]",0,"[[10002,50],[1,2500],[103,5000]]",null,1]
[21005002,105,"Task_UI_103","在沙盘地图中采集总共{0}的资源",1,803,"[150]",0,"[[10002,50],[1,2500],[104,5000]]",null,2]
[21005003,105,"Task_UI_103","{1}达到{0}级",1,602,"[3,1]",0,"[[10002,70],[1,3000],[104,5000]]",null,3,5001]
[21005004,105,"Task_UI_103","建造{0}{1}",1,601,"[1,10300]",0,"[[10002,70],[1,3000],[103,5000]]",null,4,5005]
[21005005,105,"Task_UI_103","建造{0}{1}",1,601,"[1,10301]",0,"[[10002,70],[1,3000],[104,5000]]",null,5,5006]
[21005006,105,"Task_UI_103","声望达到{0}",1,1002,"[1000]",0,"[[10002,70],[1,3000],[101,5000]]",null,6]
[21005007,105,"Task_UI_103","训练{0}个{1}",1,401,"[1000,201]",0,"[[10002,70],[1,3000],[102,5000]]",null,7,9001]
[21006001,106,"Task_UI_103","{1}达到{0}级",1,602,"[4,1]",0,"[[10002,100],[1,3500],[103,5000]]",null,1,5001]
[21006002,106,"Task_UI_103","讨伐贼寇{0}次",1,1101,"[1]",0,"[[10002,100],[1,3500],[104,5000]]",null,2]
[21006003,106,"Task_UI_103","{1}达到{0}级",1,602,"[2,20200]",0,"[[10002,100],[1,3500],[101,5000]]",null,3,5007]
[21006004,106,"Task_UI_103","建造{0}{1}",1,601,"[1,20400]",0,"[[10002,100],[1,3500],[102,5000]]",null,4,5009]
[21006005,106,"Task_UI_103","{0}支部队兵力达到{1}",1,403,"[1,12000]",0,"[[10002,100],[1,3500],[103,5000]]",null,5,3001]
[21006006,106,"Task_UI_103","攻占{0}个{1}级以上的资源田",1,804,"[3,1]",0,"[[10002,100],[1,3500],[104,5000]]",null,6]
[21006007,106,"Task_UI_103","在沙盘地图中采集总共{0}的资源",1,803,"[1000]",0,"[[10002,100],[1,3500],[101,5000]]",null,7]
[21007001,107,"Task_UI_103","{1}达到{0}级",1,602,"[6,1]",0,"[[10002,150],[1,4000],[102,5000]]",null,1,5001]
[21007002,107,"Task_UI_103","{1}达到{0}级",1,602,"[5,10100]",0,"[[10002,150],[1,4000],[103,5000]]",null,2,5002]
[21007003,107,"Task_UI_103","{1}达到{0}级",1,602,"[5,10200]",0,"[[10002,150],[1,4000],[104,5000]]",null,3,5003]
[21007004,107,"Task_UI_103","{1}达到{0}级",1,602,"[5,10201]",0,"[[10002,150],[1,4000],[101,5000]]",null,4,5004]
[21007005,107,"Task_UI_103","{1}达到{0}级",1,602,"[5,10300]",0,"[[10002,150],[1,4000],[102,5000]]",null,5,5005]
[21007006,107,"Task_UI_103","{1}达到{0}级",1,602,"[5,10301]",0,"[[10002,150],[1,4000],[103,5000]]",null,6,5006]
[21007007,107,"Task_UI_103","声望达到{0}",1,1002,"[3000]",0,"[[10002,150],[1,4000],[104,5000]]",null,7]
[21008001,108,"Task_UI_103","{1}达到{0}级",1,602,"[8,1]",0,"[[10002,200],[1,4500],[101,5000]]",null,1,5001]
[21008002,108,"Task_UI_103","讨伐贼寇{0}次",1,1101,"[15]",0,"[[10002,200],[1,4500],[102,5000]]",null,2]
[21008003,108,"Task_UI_103","{1}达到{0}级",1,602,"[3,20300]",0,"[[10002,200],[1,4500],[103,5000]]",null,3,5008]
[21008004,108,"Task_UI_103","{1}达到{0}级",1,602,"[3,20400]",0,"[[10002,100],[1,3500],[102,5000]]",null,4,5009]
[21008005,108,"Task_UI_103","训练{0}个{1}",1,401,"[5000,202]",0,"[[10002,200],[1,4500],[104,5000]]",null,4,9001]
[21008006,108,"Task_UI_103","{0}支部队兵力达到{1}",1,403,"[2,15000]",0,"[[10002,200],[1,4500],[101,5000]]",null,5,3001]
[21008007,108,"Task_UI_103","攻占{0}个{1}级以上的资源田",1,804,"[3,2]",0,"[[10002,200],[1,4500],[103,5000]]",null,7]
[21009001,109,"Task_UI_103","{1}达到{0}级",1,602,"[10,1]",0,"[[10002,250],[1,5000],[104,5000]]",null,1,5001]
[21009002,109,"Task_UI_103","{1}达到{0}级",1,602,"[8,10100]",0,"[[10002,250],[1,5000],[101,5000]]",null,2,5002]
[21009003,109,"Task_UI_103","{1}达到{0}级",1,602,"[3,20400]",0,"[[10002,250],[1,5000],[102,5000]]",null,3,5009]
[21009004,109,"Task_UI_103","{1}达到{0}级",1,602,"[5,20900]",0,"[[10002,250],[1,5000],[103,5000]]",null,4,5010]
[21009005,109,"Task_UI_103","{1}达到{0}级",1,602,"[5,20901]",0,"[[10002,250],[1,5000],[104,5000]]",null,5,5011]
[21009006,109,"Task_UI_103","{1}达到{0}级",1,602,"[5,21000]",0,"[[10002,250],[1,5000],[101,5000]]",null,6,5012]
[21009007,109,"Task_UI_103","声望达到{0}",1,1002,"[5000]",0,"[[10002,250],[1,5000],[102,5000]]",null,7]
[31001001,201,"League_UI_1306","联盟等级达到{0}级",1,3001,"[10]",0,"[[100203,2],[20001,200]]"]
[31001002,201,"League_UI_1307","联盟等级达到{0}级",1,3001,"[15]",0,"[[100203,2],[20001,300]]"]
[31001003,201,"League_UI_1308","联盟等级达到{0}级",1,3001,"[20]",0,"[[100101,2],[20001,500]]"]
[31002001,202,"League_UI_1306","联盟科技[{1}]达到{0}级",1,3005,"[3,1001]",0,"[[100203,2],[20001,100]]"]
[31002002,202,"League_UI_1307","联盟科技[{1}]达到{0}级",1,3005,"[3,3001]",0,"[[100101,2],[20001,100]]"]
[31002003,202,"League_UI_1308","联盟科技[{1}]达到{0}级",1,3005,"[3,3002]",0,"[[100203,2],[20001,100]]"]
[31003001,203,"League_UI_1306","建造{0}个联盟建筑{1}",1,3006,"[1,201005]",0,"[[100203,2],[20001,100]]"]
[31003002,203,"League_UI_1307","拆除城市耐久{0}点",1,3018,"[50]",0,"[[100101,2],[20001,100]]"]
[31003003,203,"League_UI_1308","攻城成功{0}次",1,3019,"[3]",0,"[[100203,2],[20001,200]]"]
[31004001,204,"League_UI_1306","建造{0}个联盟建筑{1}",1,3006,"[2,201003]",0,"[[100101,2],[20001,100]]"]
[31004002,204,"League_UI_1307","建造{0}个联盟建筑{1}",1,3006,"[1,201006]",0,"[[100203,2],[20001,100]]"]
[31004003,204,"League_UI_1308","建造{0}个联盟建筑{1}",1,3006,"[1,201008]",0,"[[100203,2],[20001,100]]"]
[31005001,205,"League_UI_1306","加入{0}个联邦",1,3003,"[1]",0,"[[100203,2],[20001,100]]"]
[31005002,205,"League_UI_1307","添加{0}个友盟",1,3004,"[2]",0,"[[100203,2],[20001,100]]"]
[31005003,205,"League_UI_1308","获取功勋{0}",1,3011,"[1000]",0,"[[100203,2],[20001,100]]"]
[31006001,206,"League_UI_1306","参与并成功攻占{0}座{1}级城池",1,3013,"[2,4]",0,"[[100203,2],[20001,100]]"]
[31006002,206,"League_UI_1307","参与并成功攻占{0}座郡城",1,3014,"[2]",0,"[[100203,2],[20001,100]]"]
[31006003,206,"League_UI_1308","参与并成功攻占{0}座州府",1,3015,"[2]",0,"[[100203,2],[20001,100]]"]
[31007001,207,"League_UI_1306","累计拆除{0}点玩家建筑耐久",1,3016,"[1000]",0,"[[100203,2],[20001,100]]"]
[31007002,207,"League_UI_1307","累计消灭{0}城池关卡的驻城部队",1,3017,"[3]",0,"[[100203,2],[20001,100]]"]
[31007003,207,"League_UI_1308","累计消灭{0}城池关卡的驻城部队",1,3017,"[4]",0,"[[100203,2],[20001,100]]"]
[41001001,301,"League_UI_1306","在沙盘地图中采集{0}单位{1}",1,3009,"[10000,103]",0,"[[100203,2],[20001,100]]"]
[41001002,301,"League_UI_1307","在沙盘地图中采集{0}单位{1}",1,3009,"[10000,104]",0,"[[100203,2],[20001,100]]"]
[41001003,301,"League_UI_1308","在沙盘地图中采集{0}任意资源",1,3010,"[10000]",0,"[[100101,2],[20001,100]]"]
[41002001,302,"League_UI_1306","获取功勋{0}",1,3011,"[5000]",0,"[[100203,2],[20001,100]]"]
[41002002,302,"League_UI_1307","拆除城市耐久{0}点",1,3018,"[5000]",0,"[[100101,2],[20001,100]]"]
[41002003,302,"League_UI_1308","攻城成功{0}次",1,3019,"[3]",0,"[[100203,2],[20001,100]]"]
[51001001,1001,"Achievement_Name_1001_1","在沙盘地图中采集{0}任意资源",1,803,"[100000]",0,"[[2,100],[1001,10]]"]
[51001002,1001,"Achievement_Name_1001_2","在沙盘地图中采集{0}任意资源",1,803,"[500000]",0,"[[2,100],[1001,10]]"]
[51001003,1001,"Achievement_Name_1001_3","在沙盘地图中采集{0}任意资源",1,803,"[1000000]",0,"[[2,100],[1001,10]]"]
[51002001,1002,"Achievement_Name_1002_1","在沙盘地图中采集{0}单位{1}",1,802,"[100000,101]",0,"[[2,100],[1001,10]]"]
[51002002,1002,"Achievement_Name_1002_2","在沙盘地图中采集{0}单位{1}",1,802,"[100000,102]",0,"[[2,100],[1001,10]]"]
[51002003,1002,"Achievement_Name_1002_3","在沙盘地图中采集{0}单位{1}",1,802,"[100000,103]",0,"[[2,100],[1001,10]]"]
[51003001,1003,"Achievement_Name_1003_1","{1}达到{0}级",1,602,"[3,1]",0,"[[2,100],[1001,10]]",null,null,5001]
[51003002,1003,"Achievement_Name_1003_2","{1}达到{0}级",1,602,"[7,1]",0,"[[2,100],[1001,10]]",null,null,5001]
[51003003,1003,"Achievement_Name_1003_3","{1}达到{0}级",1,602,"[12,1]",0,"[[2,100],[1001,10]]",null,null,5001]
[52001001,1101,"Achievement_Name_1101_1","{0}支部队兵力达到{1}",1,403,"[1,10000]",0,"[[2,100],[1001,10]]",null,null,3001]
[52001002,1101,"Achievement_Name_1101_2","{0}支部队兵力达到{1}",1,403,"[3,20000]",0,"[[2,100],[1001,10]]",null,null,3001]
[52001003,1101,"Achievement_Name_1101_3","{0}支部队兵力达到{1}",1,403,"[5,30000]",0,"[[2,100],[1001,10]]",null,null,3001]
[52002001,1102,"Achievement_Name_1102_1","拥有{0}个士兵",1,402,"[20000]",0,"[[2,100],[1001,10]]",null,null,9001]
[52002002,1102,"Achievement_Name_1102_2","拥有{0}个士兵",1,402,"[50000]",0,"[[2,100],[1001,10]]",null,null,9001]
[52002003,1102,"Achievement_Name_1102_3","拥有{0}个士兵",1,402,"[100000]",0,"[[2,100],[1001,10]]",null,null,9001]
[52003001,1103,"Achievement_Name_1103_1","讨伐贼寇{0}次",1,1101,"[10]",0,"[[2,100],[1001,10]]"]
[52003002,1103,"Achievement_Name_1103_2","讨伐贼寇{0}次",1,1101,"[50]",0,"[[2,100],[1001,10]]"]
[52003003,1103,"Achievement_Name_1103_3","讨伐贼寇{0}次",1,1101,"[100]",0,"[[2,100],[1001,10]]"]
[53001001,1201,"Achievement_Name_1201_1","攻占{0}个{1}级以上的资源田",1,804,"[10,2]",0,"[[2,100],[1001,10]]"]
[53001002,1201,"Achievement_Name_1201_2","攻占{0}个{1}级以上的资源田",1,804,"[30,3]",0,"[[2,100],[1001,10]]"]
[53001003,1201,"Achievement_Name_1201_3","攻占{0}个{1}级以上的资源田",1,804,"[50,4]",0,"[[2,100],[1001,10]]"]
[53002001,1202,"Achievement_Name_1202_1","攻占{0}个{1}级以上的资源田",1,804,"[10,5]",0,"[[2,100],[1001,10]]"]
[53003001,1203,"Achievement_Name_1203_1","声望达到{0}",1,1002,"[20000]",0,"[[2,100],[1001,10]]"]
[61001001,2001,"Achievement_Name_2001_1","登录{0}次游戏",1,1,"[2]",0,"[[2,100],[1002,10]]"]
[61001002,2001,"Achievement_Name_2001_2","登录{0}次游戏",1,1,"[5]",0,"[[2,100],[1002,10]]"]
[61001003,2001,"Achievement_Name_2001_3","登录{0}次游戏",1,1,"[8]",0,"[[2,100],[1002,10]]"]
[61002001,2002,"Achievement_Name_2002_1","领主等级达到{0}级",1,101,"[10]",0,"[[2,100],[1002,10]]"]
[61002002,2002,"Achievement_Name_2002_2","领主等级达到{0}级",1,101,"[30]",0,"[[2,100],[1002,10]]"]
[61002003,2002,"Achievement_Name_2002_3","领主等级达到{0}级",1,101,"[50]",0,"[[2,100],[1002,10]]"]
[61003001,2003,"Achievement_Name_2003_1","获得{0}个英雄",1,201,"[3]",0,"[[2,100],[1002,10]]"]
[61003002,2003,"Achievement_Name_2003_2","获得{0}个英雄",1,201,"[7]",0,"[[2,100],[1002,10]]"]
[61003003,2003,"Achievement_Name_2003_3","获得{0}个英雄",1,201,"[10]",0,"[[2,100],[1002,10]]"]
[61004001,2004,"Achievement_Name_2004_1","{0}个英雄星级达到{1}星",1,202,"[1,1]",0,"[[2,100],[1002,10]]",null,null,3]
[61004002,2004,"Achievement_Name_2004_2","{0}个英雄星级达到{1}星",1,202,"[3,1]",0,"[[2,100],[1002,10]]",null,null,3]
[61004003,2004,"Achievement_Name_2004_3","{0}个英雄星级达到{1}星",1,202,"[5,1]",0,"[[2,100],[1002,10]]",null,null,3]
[61004004,2004,"Achievement_Name_2004_4","{0}个英雄星级达到{1}星",1,202,"[5,2]",0,"[[2,100],[1002,10]]",null,null,3]
[61004005,2004,"Achievement_Name_2004_5","{0}个英雄星级达到{1}星",1,202,"[7,2]",0,"[[2,100],[1002,10]]",null,null,3]
[61004006,2004,"Achievement_Name_2004_6","{0}个英雄星级达到{1}星",1,202,"[10,2]",0,"[[2,100],[1002,10]]",null,null,3]
[62001001,2101,"Achievement_Name_2101_1","锻造{0}次装备",1,302,"[20]",0,"[[2,100],[1002,10]]",null,null,2001]
[62001002,2101,"Achievement_Name_2101_2","锻造{0}次装备",1,302,"[50]",0,"[[2,100],[1002,10]]",null,null,2001]
[62001003,2101,"Achievement_Name_2101_3","锻造{0}次装备",1,302,"[100]",0,"[[2,100],[1002,10]]",null,null,2001]
[62002001,2102,"Achievement_Name_2102_1","强化成功{0}次装备",1,304,"[10]",0,"[[2,100],[1002,10]]",null,null,2002]
[62002002,2102,"Achievement_Name_2102_2","强化成功{0}次装备",1,304,"[50]",0,"[[2,100],[1002,10]]",null,null,2002]
[62002003,2102,"Achievement_Name_2102_3","强化成功{0}次装备",1,304,"[100]",0,"[[2,100],[1002,10]]",null,null,2002]
[62003001,2103,"Achievement_Name_2103_1","分解{0}件装备",1,308,"[10]",0,"[[2,100],[1002,10]]",null,null,2003]
[62003002,2103,"Achievement_Name_2103_2","分解{0}件装备",1,308,"[30]",0,"[[2,100],[1002,10]]",null,null,2003]
[62003003,2103,"Achievement_Name_2103_3","分解{0}件装备",1,308,"[50]",0,"[[2,100],[1002,10]]",null,null,2003]
[63001001,2201,"Achievement_Name_2201_1","探险通关{0}次",1,501,"[20]",0,"[[2,100],[1002,10]]",null,null,6001]
[63001002,2201,"Achievement_Name_2201_2","探险通关{0}次",1,501,"[40]",0,"[[2,100],[1002,10]]",null,null,6001]
[63001003,2201,"Achievement_Name_2201_3","探险通关{0}次",1,501,"[60]",0,"[[2,100],[1002,10]]",null,null,6001]
[63002001,2202,"Achievement_Name_2202_1","扫荡关卡{0}次",1,503,"[30]",0,"[[2,100],[1002,10]]",null,null,6001]
[63002002,2202,"Achievement_Name_2202_2","扫荡关卡{0}次",1,503,"[60]",0,"[[2,100],[1002,10]]",null,null,6001]
[63002003,2202,"Achievement_Name_2202_3","扫荡关卡{0}次",1,503,"[100]",0,"[[2,100],[1002,10]]",null,null,6001]
[63003001,2203,"Achievement_Name_2203_1","探险通关{0}",1,502,"[1,1038]",0,"[[2,100],[1002,10]]",null,null,6004]
[63003002,2203,"Achievement_Name_2203_2","探险通关{0}",1,502,"[1,1058]",0,"[[2,100],[1002,10]]",null,null,6005]
[63003003,2203,"Achievement_Name_2203_3","探险通关{0}",1,502,"[1,1078]",0,"[[2,100],[1002,10]]",null,null,6006]
[64001001,2301,"Achievement_Name_2301_1","打造获得{0}件{1}品质装备",1,305,"[1,4]",0,"[[2,100],[1002,10]]",null,null,2001]
[64001002,2301,"Achievement_Name_2301_2","打造获得{0}件{1}品质装备",1,305,"[3,5]",0,"[[2,100],[1002,10]]",null,null,2001]
[64001003,2301,"Achievement_Name_2301_3","打造获得{0}件{1}品质装备",1,305,"[10,5]",0,"[[2,100],[1002,10]]",null,null,2001]
[64002001,2302,"Achievement_Name_2302_1","获得{0}件{1}品质装备",1,301,"[2,6]",0,"[[2,100],[1002,10]]"]
[64002002,2302,"Achievement_Name_2302_2","获得{0}件{1}品质装备",1,301,"[5,6]",0,"[[2,100],[1002,10]]"]
[64002003,2302,"Achievement_Name_2302_3","获得{0}件{1}品质装备",1,301,"[10,6]",0,"[[2,100],[1002,10]]"]
[64003001,2303,"Achievement_Name_2203_1","获得{0}个{1}",1,5,"[1,101]",0,"[[2,100],[1002,10]]"]
[64003002,2303,"Achievement_Name_2203_2","攻击城池耐久{0}",1,901,"[1000]",0,"[[2,100],[1002,10]]"]
[64003003,2303,"Achievement_Name_2203_3","攻城成功{0}次",1,902,"[2]",0,"[[2,100],[1002,10]]"]
[64004001,2304,"Achievement_Name_2301_1","参与并成功攻占{0}座{1}级城池",1,903,"[1,4]",0,"[[2,100],[1002,10]]"]
[64004002,2304,"Achievement_Name_2301_2","参与并成功攻占{0}座郡城",1,904,"[1]",0,"[[2,100],[1002,10]]"]
[64004003,2304,"Achievement_Name_2301_3","参与并成功攻占{0}座州府",1,905,"[1]",0,"[[2,100],[1002,10]]"]
[64005001,2305,"Achievement_Name_2302_1","累计拆除{0}点玩家建筑耐久",1,906,"[1000]",0,"[[2,100],[1002,10]]"]
[64005002,2305,"Achievement_Name_2302_2","累计消灭{0}支城池关卡的驻城部队",1,907,"[2]",0,"[[2,100],[1002,10]]"]
[64005003,2305,"Achievement_Name_2302_3","获取功勋{0}",1,1001,"[1000]",0,"[[2,100],[1002,10]]"]
[71001001,3001,null,"赛季获得{0}赛季成就积分",1,5,"[40,1001]",0,"[[2,200]]"]
[71001002,3001,null,"赛季获得{0}赛季成就积分",1,5,"[80,1001]",0,"[[2,200]]"]
[71001003,3001,null,"赛季获得{0}赛季成就积分",1,5,"[120,1001]",0,"[[2,200]]"]
[71001004,3001,null,"赛季获得{0}赛季成就积分",1,5,"[160,1001]",0,"[[2,200]]"]
[71001005,3001,null,"赛季获得{0}赛季成就积分",1,5,"[200,1001]",0,"[[2,200]]"]
[81001001,4001,null,"个人获得{0}个人成就积分",1,3,"[40,1002]",0,"[[2,200]]"]
[81001002,4001,null,"个人获得{0}个人成就积分",1,3,"[80,1002]",0,"[[2,200]]"]
[81001003,4001,null,"个人获得{0}个人成就积分",1,3,"[120,1002]",0,"[[2,200]]"]
[81001004,4001,null,"个人获得{0}个人成就积分",1,3,"[160,1002]",0,"[[2,200]]"]
[81001005,4001,null,"个人获得{0}个人成就积分",1,3,"[200,1002]",0,"[[2,200]]"]
[81001006,4001,null,"个人获得{0}个人成就积分",1,3,"[240,1002]",0,"[[2,200]]"]
[81001007,4001,null,"个人获得{0}个人成就积分",1,3,"[280,1002]",0,"[[2,200]]"]
[81001008,4001,null,"个人获得{0}个人成就积分",1,3,"[320,1002]",0,"[[2,200]]"]
[81001009,4001,null,"个人获得{0}个人成就积分",1,3,"[360,1002]",0,"[[2,200]]"]
[81001010,4001,null,"个人获得{0}个人成就积分",1,3,"[400,1002]",0,"[[2,200]]"]

{"sheet":"任务类型","index":1,"n_rows":60,"n_cols":11,"rows_kept":60,"cut":false,"hidden":false,"merged":[]}
["任务类型","任务描述Lang","说明","参数值1","参数值2","参数值3","主线中只能有一种类型的任务","大类","展示-任务所需次数","展示-描述内容","备注"]
[1,"Task_desc_1001","登录{0}次游戏","次数",null,null,"世界","通用","[0,0]","[0]"]
[2,"Task_desc_1002","累计获得{0}次霸业奖励","数量",null,null,"沙盘","通用","[0,0]","[0]"]
[3,"Task_desc_1003","获得{0}个{1}","数量","道具ID",null,"世界","通用","[0,0]","[0,9]"]
[4,"Task_desc_1004","加入/创建1个联盟{0}","任务计数，填1",null,null,"沙盘","通用","[1,1]","[0]"]
[5,"Task_desc_1061","获得{0}个{1}","数量","道具ID",null,"沙盘","通用","[0,0]","[0,9]"]
[101,"Task_desc_1005","领主等级达到{0}级","等级",null,null,"世界","领主","[0,0]","[0]"]
[201,"Task_desc_1006","获得{0}个英雄","数量",null,null,"世界","英雄","[0,0]","[0]"]
[202,"Task_desc_1007","{0}个英雄星级达到{1}星","数量","星级，记录该英雄最大星级",null,"世界","英雄","[0,0]","[0,0]"]
[203,"Task_desc_1008","累计招募到{0}名{1}类型武将","数量","职业",null,"世界","英雄","[0,0]","[0,7]"]
[204,"Task_desc_1009","累计招募{0}次","数量",null,null,"世界","英雄","[0,0]","[0]"]
[205,"Task_desc_1010","部队累计上阵{0}名英雄","数量",null,null,"世界","英雄","[0,0]","[0]"]
[301,"Task_desc_1011","获得{0}件{1}品质装备","数量","品质",null,"世界","装备","[0,0]","[0,1]"]
[302,"Task_desc_1012","锻造{0}次装备","次数",null,null,"世界","装备","[0,0]","[0]"]
[303,"Task_desc_1013","强化{0}件装备至等级{1}","数量","强化等级",null,"世界","装备","[0,0]","[0,0]"]
[304,"Task_desc_1014","强化成功{0}次装备","次数",null,null,"世界","装备","[0,0]","[0]"]
[305,"Task_desc_1015","打造获得{0}件{1}品质装备","数量","品质",null,"世界","装备","[0,0]","[0,2]"]
[306,"Task_desc_1016","穿戴{0}件装备","数量",null,null,"世界","装备","[0,0]","[0]"]
[307,"Task_desc_1017","使{0}名英雄穿戴{1}件装备","数量","数量",null,"世界","装备","[0,0]","[0,0]"]
[308,"Task_desc_1018","分解{0}件装备","数量",null,null,"世界","装备","[0,0]","[0]"]
[401,"Task_desc_1019","训练{0}个{1}","数量","等级表的士兵ID，客户端需要显示对应名字",null,"沙盘","士兵","[0,0]","[0,2]"]
[402,"Task_desc_1020","拥有{0}个士兵","数量，包括预备兵和分配士兵",null,null,"沙盘","士兵","[0,0]","[0]"]
[403,"Task_desc_1021","{0}支部队兵力达到{1}","数量","数量",null,"沙盘","士兵","[0,0]","[0,0]"]
[501,"Task_desc_1022","探险通关{0}次","次数",null,null,"世界","探险","[0,0]","[0]"]
[502,"Task_desc_1023","探险通关{0}","次数","具体关卡ID",null,"世界","探险","[1,1]","[10,3]"]
[503,"Task_desc_1024","扫荡关卡{0}次","次数",null,null,"世界","探险","[0,0]","[0]"]
[601,"Task_desc_1025","建造{0}{1}","建造完成计数","具体建筑ID",null,"沙盘","城建","[1,1]","[10,4]"]
[602,"Task_desc_1026","{1}达到{0}级","等级","具体建筑ID",null,"沙盘","城建","[0,0]","[0,4]"]
[603,"Task_desc_1027","建造/升级{0}次建筑","次数，点击开始即计数",null,null,"沙盘","城建","[0,0]","[0]"]
[804,"Task_desc_1031","攻占{0}个{1}级以上的资源田","数量","等级",null,"沙盘","资源田","[0,0]","[0,0]"]
[805,"Task_desc_1032","{0}产量达到{1}","资源类型","数量",null,"沙盘","资源田","[0,0]","[0,0]"]
[806,"Task_desc_1033","所有资源产量达到{0}","数量",null,null,"沙盘","资源田","[0,0]","[0,0]"]
[901,"Task_desc_1032","攻击城池耐久{0}","城市耐久",null,null,"沙盘","攻城","[0,0]","[0]","系统城、关隘"]
[902,"Task_desc_1033","攻城成功{0}次","数量",null,null,"沙盘","攻城","[0,0]","[0]","只对系统城和关隘攻城成功生效"]
[903,"Task_desc_1034","参与并成功攻占{0}座{1}级城池","数量","等级",null,"沙盘","攻城","[0,0]","[0,0]"]
[904,"Task_desc_1035","参与并成功攻占{0}座郡城","数量",null,null,"沙盘","攻城","[0,0]","[0]"]
[905,"Task_desc_1036","参与并成功攻占{0}座州府","数量",null,null,"沙盘","攻城","[0,0]","[0]"]
[906,"Task_desc_1037","累计拆除{0}点玩家建筑耐久","数量",null,null,"沙盘","攻城","[0,0]","[0]"]
[907,"Task_desc_1038","累计消灭{0}支城池关卡的驻城部队","数量",null,null,"沙盘","攻城","[0,0]","[0]","每击败一支部队数值+1"]
[1001,"Task_desc_1039","获取功勋{0}","数量",null,null,"沙盘","领主","[0,0]","[0]"]
[1002,"Task_desc_1040","声望达到{0}","数量",null,null,"沙盘","领主","[0,0]","[0]"]
[1101,"Task_desc_1041","讨伐贼寇{0}次","次数",null,null,"沙盘","讨伐","[0,0]","[0]"]
[3001,"Task_desc_1042","联盟等级达到{0}级","等级",null,null,"沙盘","联盟任务","[0,0]","[0]"]
[3002,"Task_desc_1043","联盟boss成功征讨{0}次","等级",null,null,"沙盘","联盟任务","[0,0]","[0]"]
[3003,"Task_desc_1044","加入{0}个联邦","数量",null,null,"沙盘","联盟任务","[0,0]","[0]"]
[3004,"Task_desc_1045","添加{0}个友盟","数量",null,null,"沙盘","联盟任务","[0,0]","[0]"]
[3005,"Task_desc_1046","联盟科技[{1}]达到{0}级","等级","科技id",null,"沙盘","联盟任务","[0,0]","[0,6]"]
[3006,"Task_desc_1047","建造{0}个联盟建筑[{1}]","数量","联盟建筑id",null,"沙盘","联盟任务","[0,0]","[0,8]"]
[3007,"Task_desc_1048","{0}个联盟建筑[{1}]升级到{2}级","数量","联盟建筑id","等级","沙盘","联盟任务","[0,0]","[0,8,0]"]
[3011,"Task_desc_1052","获取功勋{0}","数量",null,null,"沙盘","联盟任务","[0,0]","[0]"]
[3012,"Task_desc_1053","讨伐贼寇{0}次","次数",null,null,"沙盘","联盟任务","[0,0]","[0]"]
[3013,"Task_desc_1054","参与并成功攻占{0}座{1}级城池","数量","等级",null,"沙盘","联盟任务","[0,0]","[0,0]"]
[3014,"Task_desc_1055","参与并成功攻占{0}座郡城","数量",null,null,"沙盘","联盟任务","[0,0]","[0]"]
[3015,"Task_desc_1056","参与并成功攻占{0}座州府","数量",null,null,"沙盘","联盟任务","[0,0]","[0]"]
[3016,"Task_desc_1057","累计拆除{0}点玩家建筑耐久","数量",null,null,"沙盘","联盟任务","[0,0]","[0]"]
[3017,"Task_desc_1058","累计消灭{0}城池关卡的驻城部队","数量",null,null,"沙盘","联盟任务","[0,0]","[0]"]
[3018,"Task_desc_1059","攻击城市耐久{0}","城市耐久",null,null,"沙盘","联盟任务","[0,0]","[0]","系统城、关隘"]
[3019,"Task_desc_1060","攻城成功{0}次","数量",null,null,"沙盘","联盟任务","[0,0]","[0]","只对系统城和关隘攻城成功生效"]
[3020,"Task_desc_1061","攻占{0}个{1}级以上的资源田","数量","等级",null,"沙盘","联盟任务","[0,0]","[0,0]"]
[3021,"Task_desc_1062","攻占{0}块其他玩家土地","数量",null,null,"沙盘","联盟任务","[0,0]"]