{"text_format":"2","workbook":"xlsx","n_sheets":4,"sheets":["Sheet1","Sheet2","SLG","RPG"],"not_rendered":{"charts":0,"images":0,"macros":0,"external_links":0,"defined_names":0,"comments":1,"pivot_tables":0},"unopened":[],"bounds":{"document_bytes":16777216,"sheet_cells":100000,"run_cost":"one","rows_first":2000,"rows_last":500,"rows_between":2000,"halvings":0,"cell_chars":16384,"cell_head_chars":4096},"cells_cut":0,"cells_raw":0,"read":"whole","date_system":"1900"}

{"sheet":"Sheet1","index":0,"n_rows":19,"n_cols":28,"rows_kept":19,"cut":false,"hidden":false,"merged":[]}
["阵营","站位","英雄ID","名称（不导入）","职业","等级","技能1","技能2","技能3","技能4","技能5","技能6","兵力","兵种ID","最小攻击","最大攻击","最小防御","最大防御","生命","暴击率","免暴率","暴伤","抗暴伤","攻速","移速","幸运","增伤","减伤"]
[0,0,200101,"秦始皇",{"$f":"LEFT(RIGHT(C2,3),1)","v":"1"},50,{"$f":"RIGHT($C2,3)&0&0&1","v":"101001"},{"$f":"RIGHT($C2,3)&1&0&1","v":"101101"},{"$f":"RIGHT($C2,3)&2&0&1","v":"101201"},{"$f":"RIGHT($C2,3)&3&0&1","v":"101301"},{"$f":"RIGHT($C2,3)&4&0&1","v":"101401"},null,10000,106,{"$f":"VLOOKUP(_xlfn.NUMBERVALUE($E2),Sheet2!$D$4:$M$7,COLUMN()-13,FALSE)","v":4286},{"$f":"VLOOKUP(_xlfn.NUMBERVALUE($E2),Sheet2!$D$4:$M$7,COLUMN()-13,FALSE)","v":5577},{"$f":"VLOOKUP(_xlfn.NUMBERVALUE($E2),Sheet2!$D$4:$M$7,COLUMN()-13,FALSE)","v":5709},{"$f":"VLOOKUP(_xlfn.NUMBERVALUE($E2),Sheet2!$D$4:$M$7,COLUMN()-13,FALSE)","v":7608},{"$f":"VLOOKUP(_xlfn.NUMBERVALUE($E2),Sheet2!$D$4:$M$7,COLUMN()-13,FALSE)","v":48214},{"$f":"VLOOKUP(_xlfn.NUMBERVALUE($E2),Sheet2!$D$4:$M$7,COLUMN()-13,FALSE)","v":643},{"$f":"VLOOKUP(_xlfn.NUMBERVALUE($E2),Sheet2!$D$4:$M$7,COLUMN()-13,FALSE)","v":1929},{"$f":"VLOOKUP(_xlfn.NUMBERVALUE($E2),Sheet2!$D$4:$M$7,COLUMN()-13,FALSE)","v":1286},{"$f":"VLOOKUP(_xlfn.NUMBERVALUE($E2),Sheet2!$D$4:$M$7,COLUMN()-13,FALSE)","v":3857},10000,600,0,0,0]
[0,1,200102,"李舜臣","1",50,{"$f":"RIGHT($C3,3)&0&0&1","v":"102001"},{"$f":"RIGHT($C3,3)&1&0&1","v":"102101"},{"$f":"RIGHT($C3,3)&2&0&1","v":"102201"},{"$f":"RIGHT($C3,3)&3&0&1","v":"102301"},{"$f":"RIGHT($C3,3)&4&0&1","v":"102401"},null,10000,106,{"$f":"VLOOKUP(_xlfn.NUMBERVALUE($E3),Sheet2!$D$4:$M$7,COLUMN()-13,FALSE)","v":4286},{"$f":"VLOOKUP(_xlfn.NUMBERVALUE($E3),Sheet2!$D$4:$M$7,COLUMN()-13,FALSE)","v":5577},{"$f":"VLOOKUP(_xlfn.NUMBERVALUE($E3),Sheet2!$D$4:$M$7,COLUMN()-13,FALSE)","v":5709},{"$f":"VLOOKUP(_xlfn.NUMBERVALUE($E3),Sheet2!$D$4:$M$7,COLUMN()-13,FALSE)","v":7608},{"$f":"VLOOKUP(_xlfn.NUMBERVALUE($E3),Sheet2!$D$4:$M$7,COLUMN()-13,FALSE)","v":48214},{"$f":"VLOOKUP(_xlfn.NUMBERVALUE($E3),Sheet2!$D$4:$M$7,COLUMN()-13,FALSE)","v":643},{"$f":"VLOOKUP(_xlfn.NUMBERVALUE($E3),Sheet2!$D$4:$M$7,COLUMN()-13,FALSE)","v":1929},{"$f":"VLOOKUP(_xlfn.NUMBERVALUE($E3),Sheet2!$D$4:$M$7,COLUMN()-13,FALSE)","v":1286},{"$f":"VLOOKUP(_xlfn.NUMBERVALUE($E3),Sheet2!$D$4:$M$7,COLUMN()-13,FALSE)","v":3857},10000,600,0,0,0]
[0,2,200103,"居鲁士大帝","1",50,{"$f":"RIGHT($C4,3)&0&0&1","v":"103001"},{"$f":"RIGHT($C4,3)&1&0&1","v":"103101"},{"$f":"RIGHT($C4,3)&2&0&1","v":"103201"},{"$f":"RIGHT($C4,3)&3&0&1","v":"103301"},{"$f":"RIGHT($C4,3)&4&0&1","v":"103401"},null,10000,106,{"$f":"VLOOKUP(_xlfn.NUMBERVALUE($E4),Sheet2!$D$4:$M$7,COLUMN()-13,FALSE)","v":4286},{"$f":"VLOOKUP(_xlfn.NUMBERVALUE($E4),Sheet2!$D$4:$M$7,COLUMN()-13,FALSE)","v":5577},{"$f":"VLOOKUP(_xlfn.NUMBERVALUE($E4),Sheet2!$D$4:$M$7,COLUMN()-13,FALSE)","v":5709},{"$f":"VLOOKUP(_xlfn.NUMBERVALUE($E4),Sheet2!$D$4:$M$7,COLUMN()-13,FALSE)","v":7608},{"$f":"VLOOKUP(_xlfn.NUMBERVALUE($E4),Sheet2!$D$4:$M$7,COLUMN()-13,FALSE)","v":48214},{"$f":"VLOOKUP(_xlfn.NUMBERVALUE($E4),Sheet2!$D$4:$M$7,COLUMN()-13,FALSE)","v":643},{"$f":"VLOOKUP(_xlfn.NUMBERVALUE($E4),Sheet2!$D$4:$M$7,COLUMN()-13,FALSE)","v":1929},{"$f":"VLOOKUP(_xlfn.NUMBERVALUE($E4),Sheet2!$D$4:$M$7,COLUMN()-13,FALSE)","v":1286},{"$f":"VLOOKUP(_xlfn.NUMBERVALUE($E4),Sheet2!$D$4:$M$7,COLUMN()-13,FALSE)","v":3857},10000,600,0,0,0]
[0,3,200201,"织田信长","2",50,"201001","201101","201201","201301","201401",null,10000,206,{"$f":"VLOOKUP(_xlfn.NUMBERVALUE($E5),Sheet2!$D$4:$M$7,COLUMN()-13,FALSE)","v":5162},{"$f":"VLOOKUP(_xlfn.NUMBERVALUE($E5),Sheet2!$D$4:$M$7,COLUMN()-13,FALSE)","v":6809},{"$f":"VLOOKUP(_xlfn.NUMBERVALUE($E5),Sheet2!$D$4:$M$7,COLUMN()-13,FALSE)","v":4829},{"$f":"VLOOKUP(_xlfn.NUMBERVALUE($E5),Sheet2!$D$4:$M$7,COLUMN()-13,FALSE)","v":6369},{"$f":"VLOOKUP(_xlfn.NUMBERVALUE($E5),Sheet2!$D$4:$M$7,COLUMN()-13,FALSE)","v":44862},{"$f":"VLOOKUP(_xlfn.NUMBERVALUE($E5),Sheet2!$D$4:$M$7,COLUMN()-13,FALSE)","v":1385},{"$f":"VLOOKUP(_xlfn.NUMBERVALUE($E5),Sheet2!$D$4:$M$7,COLUMN()-13,FALSE)","v":1385},{"$f":"VLOOKUP(_xlfn.NUMBERVALUE($E5),Sheet2!$D$4:$M$7,COLUMN()-13,FALSE)","v":2769},{"$f":"VLOOKUP(_xlfn.NUMBERVALUE($E5),Sheet2!$D$4:$M$7,COLUMN()-13,FALSE)","v":2769},10000,600,0,0,0]
[0,4,200202,"亚历山大","2",50,{"$f":"RIGHT($C6,3)&0&0&1","v":"202001"},{"$f":"RIGHT($C6,3)&1&0&1","v":"202101"},{"$f":"RIGHT($C6,3)&2&0&1","v":"202201"},{"$f":"RIGHT($C6,3)&3&0&1","v":"202301"},{"$f":"RIGHT($C6,3)&4&0&1","v":"202401"},null,10000,206,{"$f":"VLOOKUP(_xlfn.NUMBERVALUE($E6),Sheet2!$D$4:$M$7,COLUMN()-13,FALSE)","v":5162},{"$f":"VLOOKUP(_xlfn.NUMBERVALUE($E6),Sheet2!$D$4:$M$7,COLUMN()-13,FALSE)","v":6809},{"$f":"VLOOKUP(_xlfn.NUMBERVALUE($E6),Sheet2!$D$4:$M$7,COLUMN()-13,FALSE)","v":4829},{"$f":"VLOOKUP(_xlfn.NUMBERVALUE($E6),Sheet2!$D$4:$M$7,COLUMN()-13,FALSE)","v":6369},{"$f":"VLOOKUP(_xlfn.NUMBERVALUE($E6),Sheet2!$D$4:$M$7,COLUMN()-13,FALSE)","v":44862},{"$f":"VLOOKUP(_xlfn.NUMBERVALUE($E6),Sheet2!$D$4:$M$7,COLUMN()-13,FALSE)","v":1385},{"$f":"VLOOKUP(_xlfn.NUMBERVALUE($E6),Sheet2!$D$4:$M$7,COLUMN()-13,FALSE)","v":1385},{"$f":"VLOOKUP(_xlfn.NUMBERVALUE($E6),Sheet2!$D$4:$M$7,COLUMN()-13,FALSE)","v":2769},{"$f":"VLOOKUP(_xlfn.NUMBERVALUE($E6),Sheet2!$D$4:$M$7,COLUMN()-13,FALSE)","v":2769},10000,600,0,0,0]
[0,5,200203,"萨拉丁",{"$f":"LEFT(RIGHT(C7,3),1)","v":"2"},50,{"$f":"RIGHT($C7,3)&0&0&1","v":"203001"},{"$f":"RIGHT($C7,3)&1&0&1","v":"203101"},{"$f":"RIGHT($C7,3)&2&0&1","v":"203201"},{"$f":"RIGHT($C7,3)&3&0&1","v":"203301"},{"$f":"RIGHT($C7,3)&4&0&1","v":"203401"},null,10000,206,{"$f":"VLOOKUP(_xlfn.NUMBERVALUE($E7),Sheet2!$D$4:$M$7,COLUMN()-13,FALSE)","v":5162},{"$f":"VLOOKUP(_xlfn.NUMBERVALUE($E7),Sheet2!$D$4:$M$7,COLUMN()-13,FALSE)","v":6809},{"$f":"VLOOKUP(_xlfn.NUMBERVALUE($E7),Sheet2!$D$4:$M$7,COLUMN()-13,FALSE)","v":4829},{"$f":"VLOOKUP(_xlfn.NUMBERVALUE($E7),Sheet2!$D$4:$M$7,COLUMN()-13,FALSE)","v":6369},{"$f":"VLOOKUP(_xlfn.NUMBERVALUE($E7),Sheet2!$D$4:$M$7,COLUMN()-13,FALSE)","v":44862},{"$f":"VLOOKUP(_xlfn.NUMBERVALUE($E7),Sheet2!$D$4:$M$7,COLUMN()-13,FALSE)","v":1385},{"$f":"VLOOKUP(_xlfn.NUMBERVALUE($E7),Sheet2!$D$4:$M$7,COLUMN()-13,FALSE)","v":1385},{"$f":"VLOOKUP(_xlfn.NUMBERVALUE($E7),Sheet2!$D$4:$M$7,COLUMN()-13,FALSE)","v":2769},{"$f":"VLOOKUP(_xlfn.NUMBERVALUE($E7),Sheet2!$D$4:$M$7,COLUMN()-13,FALSE)","v":2769},10000,600,0,0,0]
[0,6,200301,"图特摩斯三世","3",50,"301001","301101","301201","301301","301401",null,10000,306,{"$f":"VLOOKUP(_xlfn.NUMBERVALUE($E8),Sheet2!$D$4:$M$7,COLUMN()-13,FALSE)","v":5906},{"$f":"VLOOKUP(_xlfn.NUMBERVALUE($E8),Sheet2!$D$4:$M$7,COLUMN()-13,FALSE)","v":7897},{"$f":"VLOOKUP(_xlfn.NUMBERVALUE($E8),Sheet2!$D$4:$M$7,COLUMN()-13,FALSE)","v":3897},{"$f":"VLOOKUP(_xlfn.NUMBERVALUE($E8),Sheet2!$D$4:$M$7,COLUMN()-13,FALSE)","v":5070},{"$f":"VLOOKUP(_xlfn.NUMBERVALUE($E8),Sheet2!$D$4:$M$7,COLUMN()-13,FALSE)","v":40500},{"$f":"VLOOKUP(_xlfn.NUMBERVALUE($E8),Sheet2!$D$4:$M$7,COLUMN()-13,FALSE)","v":3000},{"$f":"VLOOKUP(_xlfn.NUMBERVALUE($E8),Sheet2!$D$4:$M$7,COLUMN()-13,FALSE)","v":0},{"$f":"VLOOKUP(_xlfn.NUMBERVALUE($E8),Sheet2!$D$4:$M$7,COLUMN()-13,FALSE)","v":6000},{"$f":"VLOOKUP(_xlfn.NUMBERVALUE($E8),Sheet2!$D$4:$M$7,COLUMN()-13,FALSE)","v":0},10000,600,0,0,0]
[0,7,200302,"阿尔特米西亚","3",50,"302001","302101","302201","302301","302401",null,10000,306,{"$f":"VLOOKUP(_xlfn.NUMBERVALUE($E9),Sheet2!$D$4:$M$7,COLUMN()-13,FALSE)","v":5906},{"$f":"VLOOKUP(_xlfn.NUMBERVALUE($E9),Sheet2!$D$4:$M$7,COLUMN()-13,FALSE)","v":7897},{"$f":"VLOOKUP(_xlfn.NUMBERVALUE($E9),Sheet2!$D$4:$M$7,COLUMN()-13,FALSE)","v":3897},{"$f":"VLOOKUP(_xlfn.NUMBERVALUE($E9),Sheet2!$D$4:$M$7,COLUMN()-13,FALSE)","v":5070},{"$f":"VLOOKUP(_xlfn.NUMBERVALUE($E9),Sheet2!$D$4:$M$7,COLUMN()-13,FALSE)","v":40500},{"$f":"VLOOKUP(_xlfn.NUMBERVALUE($E9),Sheet2!$D$4:$M$7,COLUMN()-13,FALSE)","v":3000},{"$f":"VLOOKUP(_xlfn.NUMBERVALUE($E9),Sheet2!$D$4:$M$7,COLUMN()-13,FALSE)","v":0},{"$f":"VLOOKUP(_xlfn.NUMBERVALUE($E9),Sheet2!$D$4:$M$7,COLUMN()-13,FALSE)","v":6000},{"$f":"VLOOKUP(_xlfn.NUMBERVALUE($E9),Sheet2!$D$4:$M$7,COLUMN()-13,FALSE)","v":0},10000,600,0,0,0]
[0,8,200303,"克里斯蒂娜","3",50,"303001","303101","303201","303301","303401",null,10000,306,{"$f":"VLOOKUP(_xlfn.NUMBERVALUE($E10),Sheet2!$D$4:$M$7,COLUMN()-13,FALSE)","v":5906},{"$f":"VLOOKUP(_xlfn.NUMBERVALUE($E10),Sheet2!$D$4:$M$7,COLUMN()-13,FALSE)","v":7897},{"$f":"VLOOKUP(_xlfn.NUMBERVALUE($E10),Sheet2!$D$4:$M$7,COLUMN()-13,FALSE)","v":3897},{"$f":"VLOOKUP(_xlfn.NUMBERVALUE($E10),Sheet2!$D$4:$M$7,COLUMN()-13,FALSE)","v":5070},{"$f":"VLOOKUP(_xlfn.NUMBERVALUE($E10),Sheet2!$D$4:$M$7,COLUMN()-13,FALSE)","v":40500},{"$f":"VLOOKUP(_xlfn.NUMBERVALUE($E10),Sheet2!$D$4:$M$7,COLUMN()-13,FALSE)","v":3000},{"$f":"VLOOKUP(_xlfn.NUMBERVALUE($E10),Sheet2!$D$4:$M$7,COLUMN()-13,FALSE)","v":0},{"$f":"VLOOKUP(_xlfn.NUMBERVALUE($E10),Sheet2!$D$4:$M$7,COLUMN()-13,FALSE)","v":6000},{"$f":"VLOOKUP(_xlfn.NUMBERVALUE($E10),Sheet2!$D$4:$M$7,COLUMN()-13,FALSE)","v":0},10000,600,0,0,0]
{"$rows_left_out":10}
{"sheet":"Sheet2","index":1,"n_rows":31,"n_cols":18,"rows_kept":31,"cut":false,"hidden":false,"merged":[]}
[{"$nulls":15},"ID","英雄名称","批次"]
[{"$nulls":15},200101,"秦始皇"]
[{"$nulls":15},200102,"李舜臣",2]
[null,null,null,"职业","最小攻击","最大攻击","最小防御","最大防御","生命","暴击率","免暴率","暴伤","抗暴伤",null,null,200103,"居鲁士大帝",2]
[null,null,null,1,4286,5577,5709,7608,48214,643,1929,1286,3857,null,null,200104,"阿育王",3]
[null,null,null,2,5162,6809,4829,6369,44862,1385,1385,2769,2769,null,null,200105,"斯巴达克斯",2]
[null,null,null,3,5906,7897,3897,5070,40500,3000,0,6000,0,null,null,200106,"吉尔伽美什"]
[{"$nulls":15},200107,"丰臣秀吉",3]
[{"$nulls":15},200108,"汉尼拔·巴卡",2]
[{"$nulls":15},200109,"布狄卡",3]
{"$rows_left_out":22}
{"sheet":"SLG","index":2,"n_rows":7,"n_cols":28,"rows_kept":7,"cut":false,"hidden":false,"merged":[]}
["阵营","站位","英雄ID","名称（不导入）","职业","等级","技能1","技能2","技能3","技能4","技能5","技能6","兵力","兵种ID","最小攻击","最大攻击","最小防御","最大防御","生命","暴击率","免暴率","暴伤","抗暴伤","攻速","移速","幸运","增伤","减伤"]
[0,0,200110,"威廉·华莱士",{"$f":"LEFT(RIGHT(C2,3),1)","v":"1"},50,{"$f":"RIGHT($C2,3)&0&0&1","v":"110001"},{"$f":"RIGHT($C2,3)&1&0&1","v":"110101"},{"$f":"RIGHT($C2,3)&2&0&1","v":"110201"},{"$f":"RIGHT($C2,3)&3&0&1","v":"110301"},{"$f":"RIGHT($C2,3)&4&0&1","v":"110401"},null,10000,106,{"$f":"VLOOKUP(_xlfn.NUMBERVALUE($E2),Sheet2!$D$4:$M$7,COLUMN()-13,FALSE)","v":4286},{"$f":"VLOOKUP(_xlfn.NUMBERVALUE($E2),Sheet2!$D$4:$M$7,COLUMN()-13,FALSE)","v":5577},{"$f":"VLOOKUP(_xlfn.NUMBERVALUE($E2),Sheet2!$D$4:$M$7,COLUMN()-13,FALSE)","v":5709},{"$f":"VLOOKUP(_xlfn.NUMBERVALUE($E2),Sheet2!$D$4:$M$7,COLUMN()-13,FALSE)","v":7608},{"$f":"VLOOKUP(_xlfn.NUMBERVALUE($E2),Sheet2!$D$4:$M$7,COLUMN()-13,FALSE)","v":48214},{"$f":"VLOOKUP(_xlfn.NUMBERVALUE($E2),Sheet2!$D$4:$M$7,COLUMN()-13,FALSE)","v":643},{"$f":"VLOOKUP(_xlfn.NUMBERVALUE($E2),Sheet2!$D$4:$M$7,COLUMN()-13,FALSE)","v":1929},{"$f":"VLOOKUP(_xlfn.NUMBERVALUE($E2),Sheet2!$D$4:$M$7,COLUMN()-13,FALSE)","v":1286},{"$f":"VLOOKUP(_xlfn.NUMBERVALUE($E2),Sheet2!$D$4:$M$7,COLUMN()-13,FALSE)","v":3857},10000,600,0,0,0]
[0,2,200207,"腓特烈一世",{"$f":"LEFT(RIGHT(C3,3),1)","v":"2"},50,{"$f":"RIGHT($C3,3)&0&0&1","v":"207001"},{"$f":"RIGHT($C3,3)&1&0&1","v":"207101"},{"$f":"RIGHT($C3,3)&2&0&1","v":"207201"},{"$f":"RIGHT($C3,3)&3&0&1","v":"207301"},{"$f":"RIGHT($C3,3)&4&0&1","v":"207401"},null,10000,206,{"$f":"VLOOKUP(_xlfn.NUMBERVALUE($E3),Sheet2!$D$4:$M$7,COLUMN()-13,FALSE)","v":5162},{"$f":"VLOOKUP(_xlfn.NUMBERVALUE($E3),Sheet2!$D$4:$M$7,COLUMN()-13,FALSE)","v":6809},{"$f":"VLOOKUP(_xlfn.NUMBERVALUE($E3),Sheet2!$D$4:$M$7,COLUMN()-13,FALSE)","v":4829},{"$f":"VLOOKUP(_xlfn.NUMBERVALUE($E3),Sheet2!$D$4:$M$7,COLUMN()-13,FALSE)","v":6369},{"$f":"VLOOKUP(_xlfn.NUMBERVALUE($E3),Sheet2!$D$4:$M$7,COLUMN()-13,FALSE)","v":44862},{"$f":"VLOOKUP(_xlfn.NUMBERVALUE($E3),Sheet2!$D$4:$M$7,COLUMN()-13,FALSE)","v":1385},{"$f":"VLOOKUP(_xlfn.NUMBERVALUE($E3),Sheet2!$D$4:$M$7,COLUMN()-13,FALSE)","v":1385},{"$f":"VLOOKUP(_xlfn.NUMBERVALUE($E3),Sheet2!$D$4:$M$7,COLUMN()-13,FALSE)","v":2769},{"$f":"VLOOKUP(_xlfn.NUMBERVALUE($E3),Sheet2!$D$4:$M$7,COLUMN()-13,FALSE)","v":2769},10000,600,0,0,0]
[0,4,200304,"伯里克利","3",50,"304001","304101","304201","304301","304401",null,10000,306,{"$f":"VLOOKUP(_xlfn.NUMBERVALUE($E4),Sheet2!$D$4:$M$7,COLUMN()-13,FALSE)","v":5906},{"$f":"VLOOKUP(_xlfn.NUMBERVALUE($E4),Sheet2!$D$4:$M$7,COLUMN()-13,FALSE)","v":7897},{"$f":"VLOOKUP(_xlfn.NUMBERVALUE($E4),Sheet2!$D$4:$M$7,COLUMN()-13,FALSE)","v":3897},{"$f":"VLOOKUP(_xlfn.NUMBERVALUE($E4),Sheet2!$D$4:$M$7,COLUMN()-13,FALSE)","v":5070},{"$f":"VLOOKUP(_xlfn.NUMBERVALUE($E4),Sheet2!$D$4:$M$7,COLUMN()-13,FALSE)","v":40500},{"$f":"VLOOKUP(_xlfn.NUMBERVALUE($E4),Sheet2!$D$4:$M$7,COLUMN()-13,FALSE)","v":3000},{"$f":"VLOOKUP(_xlfn.NUMBERVALUE($E4),Sheet2!$D$4:$M$7,COLUMN()-13,FALSE)","v":0},{"$f":"VLOOKUP(_xlfn.NUMBERVALUE($E4),Sheet2!$D$4:$M$7,COLUMN()-13,FALSE)","v":6000},{"$f":"VLOOKUP(_xlfn.NUMBERVALUE($E4),Sheet2!$D$4:$M$7,COLUMN()-13,FALSE)","v":0},10000,600,0,0,0]
[1,0,200107,"丰臣秀吉","1",50,{"$f":"RIGHT($C5,3)&0&0&1","v":"107001"},{"$f":"RIGHT($C5,3)&1&0&1","v":"107101"},{"$f":"RIGHT($C5,3)&2&0&1","v":"107201"},{"$f":"RIGHT($C5,3)&3&0&1","v":"107301"},{"$f":"RIGHT($C5,3)&4&0&1","v":"107401"},null,10000,106,{"$f":"VLOOKUP(_xlfn.NUMBERVALUE($E5),Sheet2!$D$4:$M$7,COLUMN()-13,FALSE)","v":4286},{"$f":"VLOOKUP(_xlfn.NUMBERVALUE($E5),Sheet2!$D$4:$M$7,COLUMN()-13,FALSE)","v":5577},{"$f":"VLOOKUP(_xlfn.NUMBERVALUE($E5),Sheet2!$D$4:$M$7,COLUMN()-13,FALSE)","v":5709},{"$f":"VLOOKUP(_xlfn.NUMBERVALUE($E5),Sheet2!$D$4:$M$7,COLUMN()-13,FALSE)","v":7608},{"$f":"VLOOKUP(_xlfn.NUMBERVALUE($E5),Sheet2!$D$4:$M$7,COLUMN()-13,FALSE)","v":48214},{"$f":"VLOOKUP(_xlfn.NUMBERVALUE($E5),Sheet2!$D$4:$M$7,COLUMN()-13,FALSE)","v":643},{"$f":"VLOOKUP(_xlfn.NUMBERVALUE($E5),Sheet2!$D$4:$M$7,COLUMN()-13,FALSE)","v":1929},{"$f":"VLOOKUP(_xlfn.NUMBERVALUE($E5),Sheet2!$D$4:$M$7,COLUMN()-13,FALSE)","v":1286},{"$f":"VLOOKUP(_xlfn.NUMBERVALUE($E5),Sheet2!$D$4:$M$7,COLUMN()-13,FALSE)","v":3857},10000,600,0,0,0]
[1,2,200205,"花木兰","2",50,{"$f":"RIGHT($C6,3)&0&0&1","v":"205001"},{"$f":"RIGHT($C6,3)&1&0&1","v":"205101"},{"$f":"RIGHT($C6,3)&2&0&1","v":"205201"},{"$f":"RIGHT($C6,3)&3&0&1","v":"205301"},{"$f":"RIGHT($C6,3)&4&0&1","v":"205401"},null,10000,206,{"$f":"VLOOKUP(_xlfn.NUMBERVALUE($E6),Sheet2!$D$4:$M$7,COLUMN()-13,FALSE)","v":5162},{"$f":"VLOOKUP(_xlfn.NUMBERVALUE($E6),Sheet2!$D$4:$M$7,COLUMN()-13,FALSE)","v":6809},{"$f":"VLOOKUP(_xlfn.NUMBERVALUE($E6),Sheet2!$D$4:$M$7,COLUMN()-13,FALSE)","v":4829},{"$f":"VLOOKUP(_xlfn.NUMBERVALUE($E6),Sheet2!$D$4:$M$7,COLUMN()-13,FALSE)","v":6369},{"$f":"VLOOKUP(_xlfn.NUMBERVALUE($E6),Sheet2!$D$4:$M$7,COLUMN()-13,FALSE)","v":44862},{"$f":"VLOOKUP(_xlfn.NUMBERVALUE($E6),Sheet2!$D$4:$M$7,COLUMN()-13,FALSE)","v":1385},{"$f":"VLOOKUP(_xlfn.NUMBERVALUE($E6),Sheet2!$D$4:$M$7,COLUMN()-13,FALSE)","v":1385},{"$f":"VLOOKUP(_xlfn.NUMBERVALUE($E6),Sheet2!$D$4:$M$7,COLUMN()-13,FALSE)","v":2769},{"$f":"VLOOKUP(_xlfn.NUMBERVALUE($E6),Sheet2!$D$4:$M$7,COLUMN()-13,FALSE)","v":2769},10000,600,0,0,0]
[1,4,200308,"托米丽司","3",50,"308001","308101","308201","308301","308401",null,10000,306,{"$f":"VLOOKUP(_xlfn.NUMBERVALUE($E7),Sheet2!$D$4:$M$7,COLUMN()-13,FALSE)","v":5906},{"$f":"VLOOKUP(_xlfn.NUMBERVALUE($E7),Sheet2!$D$4:$M$7,COLUMN()-13,FALSE)","v":7897},{"$f":"VLOOKUP(_xlfn.NUMBERVALUE($E7),Sheet2!$D$4:$M$7,COLUMN()-13,FALSE)","v":3897},{"$f":"VLOOKUP(_xlfn.NUMBERVALUE($E7),Sheet2!$D$4:$M$7,COLUMN()-13,FALSE)","v":5070},{"$f":"VLOOKUP(_xlfn.NUMBERVALUE($E7),Sheet2!$D$4:$M$7,COLUMN()-13,FALSE)","v":40500},{"$f":"VLOOKUP(_xlfn.NUMBERVALUE($E7),Sheet2!$D$4:$M$7,COLUMN()-13,FALSE)","v":3000},{"$f":"VLOOKUP(_xlfn.NUMBERVALUE($E7),Sheet2!$D$4:$M$7,COLUMN()-13,FALSE)","v":0},{"$f":"VLOOKUP(_xlfn.NUMBERVALUE($E7),Sheet2!$D$4:$M$7,COLUMN()-13,FALSE)","v":6000},{"$f":"VLOOKUP(_xlfn.NUMBERVALUE($E7),Sheet2!$D$4:$M$7,COLUMN()-13,FALSE)","v":0},10000,600,0,0,0]

{"sheet":"RPG","index":3,"n_rows":11,"n_cols":28,"rows_kept":11,"cut":false,"hidden":false,"merged":[]}
["阵营","站位","英雄ID","名称（不导入）","职业","等级","技能1","技能2","技能3","技能4","技能5","技能6","兵力","兵种ID","最小攻击","最大攻击","最小防御","最大防御","生命","暴击率","免暴率","暴伤","抗暴伤","攻速","移速","幸运","增伤","减伤"]
[0,0,200204,"理查一世",2,50,{"$f":"RIGHT($C2,3)&0&0&1","v":"204001"},{"$f":"RIGHT($C2,3)&1&0&1","v":"204101"},{"$f":"RIGHT($C2,3)&2&0&1","v":"204201"},{"$f":"RIGHT($C2,3)&3&0&1","v":"204301"},{"$f":"RIGHT($C2,3)&4&0&1","v":"204401"},null,null,null,{"$f":"VLOOKUP(_xlfn.NUMBERVALUE($E2),Sheet2!$D$4:$M$7,COLUMN()-13,FALSE)","v":5162},{"$f":"VLOOKUP(_xlfn.NUMBERVALUE($E2),Sheet2!$D$4:$M$7,COLUMN()-13,FALSE)","v":6809},{"$f":"VLOOKUP(_xlfn.NUMBERVALUE($E2),Sheet2!$D$4:$M$7,COLUMN()-13,FALSE)","v":4829},{"$f":"VLOOKUP(_xlfn.NUMBERVALUE($E2),Sheet2!$D$4:$M$7,COLUMN()-13,FALSE)","v":6369},{"$f":"VLOOKUP(_xlfn.NUMBERVALUE($E2),Sheet2!$D$4:$M$7,COLUMN()-13,FALSE)","v":44862},{"$f":"VLOOKUP(_xlfn.NUMBERVALUE($E2),Sheet2!$D$4:$M$7,COLUMN()-13,FALSE)","v":1385},{"$f":"VLOOKUP(_xlfn.NUMBERVALUE($E2),Sheet2!$D$4:$M$7,COLUMN()-13,FALSE)","v":1385},{"$f":"VLOOKUP(_xlfn.NUMBERVALUE($E2),Sheet2!$D$4:$M$7,COLUMN()-13,FALSE)","v":2769},{"$f":"VLOOKUP(_xlfn.NUMBERVALUE($E2),Sheet2!$D$4:$M$7,COLUMN()-13,FALSE)","v":2769},10000,600,0,0,0]
[0,1,200206,"兰甘亨",{"$f":"LEFT(RIGHT(C3,3),1)","v":"2"},50,{"$f":"RIGHT($C3,3)&0&0&1","v":"206001"},{"$f":"RIGHT($C3,3)&1&0&1","v":"206101"},{"$f":"RIGHT($C3,3)&2&0&1","v":"206201"},{"$f":"RIGHT($C3,3)&3&0&1","v":"206301"},{"$f":"RIGHT($C3,3)&4&0&1","v":"206401"},null,null,null,{"$f":"VLOOKUP(_xlfn.NUMBERVALUE($E3),Sheet2!$D$4:$M$7,COLUMN()-13,FALSE)","v":5162},{"$f":"VLOOKUP(_xlfn.NUMBERVALUE($E3),Sheet2!$D$4:$M$7,COLUMN()-13,FALSE)","v":6809},{"$f":"VLOOKUP(_xlfn.NUMBERVALUE($E3),Sheet2!$D$4:$M$7,COLUMN()-13,FALSE)","v":4829},{"$f":"VLOOKUP(_xlfn.NUMBERVALUE($E3),Sheet2!$D$4:$M$7,COLUMN()-13,FALSE)","v":6369},{"$f":"VLOOKUP(_xlfn.NUMBERVALUE($E3),Sheet2!$D$4:$M$7,COLUMN()-13,FALSE)","v":44862},{"$f":"VLOOKUP(_xlfn.NUMBERVALUE($E3),Sheet2!$D$4:$M$7,COLUMN()-13,FALSE)","v":1385},{"$f":"VLOOKUP(_xlfn.NUMBERVALUE($E3),Sheet2!$D$4:$M$7,COLUMN()-13,FALSE)","v":1385},{"$f":"VLOOKUP(_xlfn.NUMBERVALUE($E3),Sheet2!$D$4:$M$7,COLUMN()-13,FALSE)","v":2769},{"$f":"VLOOKUP(_xlfn.NUMBERVALUE($E3),Sheet2!$D$4:$M$7,COLUMN()-13,FALSE)","v":2769},10000,600,0,0,0]
[0,2,200109,"布狄卡","1",50,{"$f":"RIGHT($C4,3)&0&0&1","v":"109001"},{"$f":"RIGHT($C4,3)&1&0&1","v":"109101"},{"$f":"RIGHT($C4,3)&2&0&1","v":"109201"},{"$f":"RIGHT($C4,3)&3&0&1","v":"109301"},{"$f":"RIGHT($C4,3)&4&0&1","v":"109401"},null,null,null,{"$f":"VLOOKUP(_xlfn.NUMBERVALUE($E4),Sheet2!$D$4:$M$7,COLUMN()-13,FALSE)","v":4286},{"$f":"VLOOKUP(_xlfn.NUMBERVALUE($E4),Sheet2!$D$4:$M$7,COLUMN()-13,FALSE)","v":5577},{"$f":"VLOOKUP(_xlfn.NUMBERVALUE($E4),Sheet2!$D$4:$M$7,COLUMN()-13,FALSE)","v":5709},{"$f":"VLOOKUP(_xlfn.NUMBERVALUE($E4),Sheet2!$D$4:$M$7,COLUMN()-13,FALSE)","v":7608},{"$f":"VLOOKUP(_xlfn.NUMBERVALUE($E4),Sheet2!$D$4:$M$7,COLUMN()-13,FALSE)","v":48214},{"$f":"VLOOKUP(_xlfn.NUMBERVALUE($E4),Sheet2!$D$4:$M$7,COLUMN()-13,FALSE)","v":643},{"$f":"VLOOKUP(_xlfn.NUMBERVALUE($E4),Sheet2!$D$4:$M$7,COLUMN()-13,FALSE)","v":1929},{"$f":"VLOOKUP(_xlfn.NUMBERVALUE($E4),Sheet2!$D$4:$M$7,COLUMN()-13,FALSE)","v":1286},{"$f":"VLOOKUP(_xlfn.NUMBERVALUE($E4),Sheet2!$D$4:$M$7,COLUMN()-13,FALSE)","v":3857},10000,600,0,0,0]
[0,3,200304,"伯里克利","3",50,"304001","304101","304201","304301","304401",null,null,null,{"$f":"VLOOKUP(_xlfn.NUMBERVALUE($E5),Sheet2!$D$4:$M$7,COLUMN()-13,FALSE)","v":5906},{"$f":"VLOOKUP(_xlfn.NUMBERVALUE($E5),Sheet2!$D$4:$M$7,COLUMN()-13,FALSE)","v":7897},{"$f":"VLOOKUP(_xlfn.NUMBERVALUE($E5),Sheet2!$D$4:$M$7,COLUMN()-13,FALSE)","v":3897},{"$f":"VLOOKUP(_xlfn.NUMBERVALUE($E5),Sheet2!$D$4:$M$7,COLUMN()-13,FALSE)","v":5070},{"$f":"VLOOKUP(_xlfn.NUMBERVALUE($E5),Sheet2!$D$4:$M$7,COLUMN()-13,FALSE)","v":40500},{"$f":"VLOOKUP(_xlfn.NUMBERVALUE($E5),Sheet2!$D$4:$M$7,COLUMN()-13,FALSE)","v":3000},{"$f":"VLOOKUP(_xlfn.NUMBERVALUE($E5),Sheet2!$D$4:$M$7,COLUMN()-13,FALSE)","v":0},{"$f":"VLOOKUP(_xlfn.NUMBERVALUE($E5),Sheet2!$D$4:$M$7,COLUMN()-13,FALSE)","v":6000},{"$f":"VLOOKUP(_xlfn.NUMBERVALUE($E5),Sheet2!$D$4:$M$7,COLUMN()-13,FALSE)","v":0},10000,600,0,0,0]
[0,5,200305,"大卫王","3",50,{"$f":"RIGHT($C6,3)&0&0&1","v":"305001"},{"$f":"RIGHT($C6,3)&1&0&1","v":"305101"},{"$f":"RIGHT($C6,3)&2&0&1","v":"305201"},{"$f":"RIGHT($C6,3)&3&0&1","v":"305301"},{"$f":"RIGHT($C6,3)&4&0&1","v":"305401"},null,null,null,{"$f":"VLOOKUP(_xlfn.NUMBERVALUE($E6),Sheet2!$D$4:$M$7,COLUMN()-13,FALSE)","v":5906},{"$f":"VLOOKUP(_xlfn.NUMBERVALUE($E6),Sheet2!$D$4:$M$7,COLUMN()-13,FALSE)","v":7897},{"$f":"VLOOKUP(_xlfn.NUMBERVALUE($E6),Sheet2!$D$4:$M$7,COLUMN()-13,FALSE)","v":3897},{"$f":"VLOOKUP(_xlfn.NUMBERVALUE($E6),Sheet2!$D$4:$M$7,COLUMN()-13,FALSE)","v":5070},{"$f":"VLOOKUP(_xlfn.NUMBERVALUE($E6),Sheet2!$D$4:$M$7,COLUMN()-13,FALSE)","v":40500},{"$f":"VLOOKUP(_xlfn.NUMBERVALUE($E6),Sheet2!$D$4:$M$7,COLUMN()-13,FALSE)","v":3000},{"$f":"VLOOKUP(_xlfn.NUMBERVALUE($E6),Sheet2!$D$4:$M$7,COLUMN()-13,FALSE)","v":0},{"$f":"VLOOKUP(_xlfn.NUMBERVALUE($E6),Sheet2!$D$4:$M$7,COLUMN()-13,FALSE)","v":6000},{"$f":"VLOOKUP(_xlfn.NUMBERVALUE($E6),Sheet2!$D$4:$M$7,COLUMN()-13,FALSE)","v":0},10000,600,0,0,0]
[1,0,200104,"阿育王","1",50,{"$f":"RIGHT($C7,3)&0&0&1","v":"104001"},{"$f":"RIGHT($C7,3)&1&0&1","v":"104101"},{"$f":"RIGHT($C7,3)&2&0&1","v":"104201"},{"$f":"RIGHT($C7,3)&3&0&1","v":"104301"},{"$f":"RIGHT($C7,3)&4&0&1","v":"104401"},null,null,null,{"$f":"VLOOKUP(_xlfn.NUMBERVALUE($E7),Sheet2!$D$4:$M$7,COLUMN()-13,FALSE)","v":4286},{"$f":"VLOOKUP(_xlfn.NUMBERVALUE($E7),Sheet2!$D$4:$M$7,COLUMN()-13,FALSE)","v":5577},{"$f":"VLOOKUP(_xlfn.NUMBERVALUE($E7),Sheet2!$D$4:$M$7,COLUMN()-13,FALSE)","v":5709},{"$f":"VLOOKUP(_xlfn.NUMBERVALUE($E7),Sheet2!$D$4:$M$7,COLUMN()-13,FALSE)","v":7608},{"$f":"VLOOKUP(_xlfn.NUMBERVALUE($E7),Sheet2!$D$4:$M$7,COLUMN()-13,FALSE)","v":48214},{"$f":"VLOOKUP(_xlfn.NUMBERVALUE($E7),Sheet2!$D$4:$M$7,COLUMN()-13,FALSE)","v":643},{"$f":"VLOOKUP(_xlfn.NUMBERVALUE($E7),Sheet2!$D$4:$M$7,COLUMN()-13,FALSE)","v":1929},{"$f":"VLOOKUP(_xlfn.NUMBERVALUE($E7),Sheet2!$D$4:$M$7,COLUMN()-13,FALSE)","v":1286},{"$f":"VLOOKUP(_xlfn.NUMBERVALUE($E7),Sheet2!$D$4:$M$7,COLUMN()-13,FALSE)","v":3857},10000,600,0,0,0]
[1,1,200107,"丰臣秀吉","1",50,{"$f":"RIGHT($C8,3)&0&0&1","v":"107001"},{"$f":"RIGHT($C8,3)&1&0&1","v":"107101"},{"$f":"RIGHT($C8,3)&2&0&1","v":"107201"},{"$f":"RIGHT($C8,3)&3&0&1","v":"107301"},{"$f":"RIGHT($C8,3)&4&0&1","v":"107401"},null,null,null,{"$f":"VLOOKUP(_xlfn.NUMBERVALUE($E8),Sheet2!$D$4:$M$7,COLUMN()-13,FALSE)","v":4286},{"$f":"VLOOKUP(_xlfn.NUMBERVALUE($E8),Sheet2!$D$4:$M$7,COLUMN()-13,FALSE)","v":5577},{"$f":"VLOOKUP(_xlfn.NUMBERVALUE($E8),Sheet2!$D$4:$M$7,COLUMN()-13,FALSE)","v":5709},{"$f":"VLOOKUP(_xlfn.NUMBERVALUE($E8),Sheet2!$D$4:$M$7,COLUMN()-13,FALSE)","v":7608},{"$f":"VLOOKUP(_xlfn.NUMBERVALUE($E8),Sheet2!$D$4:$M$7,COLUMN()-13,FALSE)","v":48214},{"$f":"VLOOKUP(_xlfn.NUMBERVALUE($E8),Sheet2!$D$4:$M$7,COLUMN()-13,FALSE)","v":643},{"$f":"VLOOKUP(_xlfn.NUMBERVALUE($E8),Sheet2!$D$4:$M$7,COLUMN()-13,FALSE)","v":1929},{"$f":"VLOOKUP(_xlfn.NUMBERVALUE($E8),Sheet2!$D$4:$M$7,COLUMN()-13,FALSE)","v":1286},{"$f":"VLOOKUP(_xlfn.NUMBERVALUE($E8),Sheet2!$D$4:$M$7,COLUMN()-13,FALSE)","v":3857},10000,600,0,0,0]
[1,2,200207,"腓特烈一世","2",50,"207001","207101","207201","207301","207401",null,null,null,{"$f":"VLOOKUP(_xlfn.NUMBERVALUE($E9),Sheet2!$D$4:$M$7,COLUMN()-13,FALSE)","v":5162},{"$f":"VLOOKUP(_xlfn.NUMBERVALUE($E9),Sheet2!$D$4:$M$7,COLUMN()-13,FALSE)","v":6809},{"$f":"VLOOKUP(_xlfn.NUMBERVALUE($E9),Sheet2!$D$4:$M$7,COLUMN()-13,FALSE)","v":4829},{"$f":"VLOOKUP(_xlfn.NUMBERVALUE($E9),Sheet2!$D$4:$M$7,COLUMN()-13,FALSE)","v":6369},{"$f":"VLOOKUP(_xlfn.NUMBERVALUE($E9),Sheet2!$D$4:$M$7,COLUMN()-13,FALSE)","v":44862},{"$f":"VLOOKUP(_xlfn.NUMBERVALUE($E9),Sheet2!$D$4:$M$7,COLUMN()-13,FALSE)","v":1385},{"$f":"VLOOKUP(_xlfn.NUMBERVALUE($E9),Sheet2!$D$4:$M$7,COLUMN()-13,FALSE)","v":1385},{"$f":"VLOOKUP(_xlfn.NUMBERVALUE($E9),Sheet2!$D$4:$M$7,COLUMN()-13,FALSE)","v":2769},{"$f":"VLOOKUP(_xlfn.NUMBERVALUE($E9),Sheet2!$D$4:$M$7,COLUMN()-13,FALSE)","v":2769},10000,600,0,0,0]
[1,3,200308,"托米丽司","3",50,{"$f":"RIGHT($C10,3)&0&0&1","v":"308001"},{"$f":"RIGHT($C10,3)&1&0&1","v":"308101"},{"$f":"RIGHT($C10,3)&2&0&1","v":"308201"},{"$f":"RIGHT($C10,3)&3&0&1","v":"308301"},{"$f":"RIGHT($C10,3)&4&0&1","v":"308401"},null,null,null,{"$f":"VLOOKUP(_xlfn.NUMBERVALUE($E10),Sheet2!$D$4:$M$7,COLUMN()-13,FALSE)","v":5906},{"$f":"VLOOKUP(_xlfn.NUMBERVALUE($E10),Sheet2!$D$4:$M$7,COLUMN()-13,FALSE)","v":7897},{"$f":"VLOOKUP(_xlfn.NUMBERVALUE($E10),Sheet2!$D$4:$M$7,COLUMN()-13,FALSE)","v":3897},{"$f":"VLOOKUP(_xlfn.NUMBERVALUE($E10),Sheet2!$D$4:$M$7,COLUMN()-13,FALSE)","v":5070},{"$f":"VLOOKUP(_xlfn.NUMBERVALUE($E10),Sheet2!$D$4:$M$7,COLUMN()-13,FALSE)","v":40500},{"$f":"VLOOKUP(_xlfn.NUMBERVALUE($E10),Sheet2!$D$4:$M$7,COLUMN()-13,FALSE)","v":3000},{"$f":"VLOOKUP(_xlfn.NUMBERVALUE($E10),Sheet2!$D$4:$M$7,COLUMN()-13,FALSE)","v":0},{"$f":"VLOOKUP(_xlfn.NUMBERVALUE($E10),Sheet2!$D$4:$M$7,COLUMN()-13,FALSE)","v":6000},{"$f":"VLOOKUP(_xlfn.NUMBERVALUE($E10),Sheet2!$D$4:$M$7,COLUMN()-13,FALSE)","v":0},10000,600,0,0,0]
{"$rows_left_out":1}